Tutorial

Error C2039 Visual Studio

RECOMMENDED: If you have Windows errors then we strongly recommend that you download and run this (Windows) Repair Tool.

The following snipped produces a compiler error C2039. ensure that platform toolset is set to "Visual Studio 2017 (v141)" – set C++ language.

Error C2039: 'max' : is not a member of 'std' Visual Studio Languages , Windows Desktop Development > Visual C++.

Error Domain Nsposixerrordomain Code 61 Globalroot Error 2015-03-18 12:19:35(error): Cannot access directory to backup: "? GLOBALROOTDeviceHarddiskVolumeShadowCopy51Maintenance. ANS4987E Error processing '?GLOBALROOTDeviceHarddiskVolume2EFI MicrosoftBootBCD': the object is in use by another process ANS1228E Sending. This section is aimed to help troubleshooting Microsoft SQL Server problems Jun 05, 2012  · I have a server 2003 that has developed problems with shadow copies. Numerous shadow copies

C:Program Files (x86)Microsoft Visual Studio 14.0VCINCLUDEcstdint(23): error C2039: 'int_least8_t': is not a member of 'global namespace.

[vtkusers] build errors VS12, need to #include <algorithm. – Nov 14, 2013. using Visual > > Studio 2013 (aka Visual Studio 12) and compiling 64 bit. > > > > I get error messages like > > > > error C2039: 'max' : is not a.

Iterative Closest Point (ICP) for 2D curves with OpenCV. – Hi Roy I download and set up OpenCV 2.0 in my desktop and run your code again. Here are those errors i got. Error 15 error C2064: term does not evaluate to a function.

Error Rundll Vista This is how you fix it. Hope it works. Let me know. Right-click the desktop in Windows Vista and you can’t directly access the display settings. Double-click this new key’s (Default) value and enter this text: ‘rundll32 shell32.dll,Control_ RunDLL DESK.CPL,@0,3’. (That’s a zero following the. Thereafter I start getting the following RunDLL popup:. I saw

Below are the errors that are shown in the Error list of Visual Studio 2015: Error C2039 'vector': is not a member of 'std' CPPAssessment hero.h 13 Error.

Build Caffe in Windows with Visual Studio 2013 +. – Jan 11, 2015  · Caffe is a deep learning framework popular in Linux with Python or Matlab interface. I just managed to compile Caffe in Windows, and I think it’s worth.

Jun 8, 2012. I'm trying out the release candidate of Visual Studio 2012. 2>lock_byte.obj : error LNK2026: module unsafe for SAFESEH image. 2> Creating.

I receive this error in Visual Studio 2010 Express: error C2039: 'string' : is not a member of 'std' This is the header FMAT.h.

Compiler Errors C2001 through C2099 Compiler Error C2039. Compiler Error C2039. The new home for Visual Studio documentation is Visual Studio 2017 Documentation.

c2039 VS2012 build erros – OpenCV Q&A Forum – c2039 VS2012 build erros. VS2012;. under Windows 8 in 32bit mode, I get the following error(s) in Debug mode: C.

Error In Jvm Dll Trying to open Eclipse after a couple of months and get this error: So I checked that folder to see if it existed, and it did: I checked my PATH Was correct and it. Looking for a label? Just start typing. Powered by Atlassian Confluence, the Enterprise Wiki lp_solve is a free (see LGPL for

With support for generalized constexpr and NSDMI for aggregates, the compiler is now complete for features added in the C++14 Standard. Note that the compiler still.

C++17 language fixes and deprecation. What was removed from the language? What’s now working better?

C:Program FilesMicrosoft Visual Studio.NET 2003Vc7includecstdlib(22): error C2039: 'exit' : is not a member of 'operator“global.

RECOMMENDED: Click here to fix Windows errors and improve system performance