Tutorial

Error Opening Datafile The System Cannot Find The Path Specified

RECOMMENDED: If you have Windows errors then we strongly recommend that you download and run this (Windows) Repair Tool.

Error opening datafile: The system cannot find the path specifiedI have a dts package the when scheduled fails with this error: "Error opening datafile: The system.

Error Identifier / Description Code Severity / Facility Code; ERROR_SUCCESS: 0x0: The operation completed successfully. 0: ERROR_INVALID_FUNCTION: 0x1: Incorrect.

Discusses an issue where you receive a "System cannot find the path specified" error message when you open an MMC snap-in or you start Internet Services.

SQL> CREATE BIGFILE TABLESPACE oracle_tbs DATAFILE 'c:oracle_tbs oracle_tbs.dbf' SIZE 1G AUTOEXTEND ON EXTENT. OSD-04002: unable to open file. O/S-Error: (OS 3) The system cannot find the path specified.

Jun 30, 2016. 0 [ERROR] InnoDB: The error means the system cannot find the path specified. 0 [ERROR] InnoDB: Cannot open datafile for read-only: '.

I can't download anymore.I can connect to peers but after about 3 seconds of downloading i get the error message "Error: The system cannot find the path spe.

If Outlook isn’t launching properly, you might need to repair. path here] is not an Outlook data file (.pst). Cannot start Microsoft Office Outlook. Cannot open the Outlook window. The set of folders cannot be opened. The operation failed.

machine – Open the Actions. for every user in the system. This can help to track suspicious files that an attacker may have dropped on the system. NOTE: If the file contains.

Mar 6, 2017. Error: open.helmrepositorycachelocal-index.yaml: The system cannot find the path specified. looking at what helm init has created I can see.

I have 5 instances of the error, The system cannot find the path specified error 0x80070003. 1.Open Computer by clicking the Start button ,

Pos Terminal Up-700 Ram Error System Error 5053 Jan 20, 2010. Message: The Windows Process Activation Service encountered an error trying to read configuration data from file '%1', line number '%2'. Jan 20, 2010. The error type is '%2'. To resolve this issue, please ensure that the ApplicationHost.config file is correct and recommit the last configuration. Sounds like there is

In my previous article, you learned how to build a smart lock for use in a disconnected environment, one where the lock itself cannot communicate.

O/S-Error: (OS 3) The system cannot find the path specified. windows xp 64bit, oracle 10.2. channel c1: specifying datafile(s) in backupset input datafile fno= 00001. OSD-04002: unable to open file. O/S-Error: (OS 3) The.

Creating Business Applications With REBOL – Creating Business Applications With REBOL By: Nick Antonaccio Updated: 12-16-2015 Learn to solve common business data management problems with a versatile development.

Pooled Standard Error Calculator System Error 5053 Jan 20, 2010. Message: The Windows Process Activation Service encountered an error trying to read configuration data from file '%1', line number '%2'. Jan 20, 2010. The error type is '%2'. To resolve this issue, please ensure that the ApplicationHost.config file is correct and recommit the last configuration. Sounds like there is
Pdf Error Page 04.011 Clip web images, web pages, and PDF files. Access your notebooks while offline. You won’t be able to catch every writing error that you could possibly make, but. View and Download Electrolux Convection Oven specifications online. Gas Convection 5x(400×600) Bakery. Convection Oven Convection Oven pdf. WT63EB ERROR CODE C8 ×. The most likely explanation is

Nov 9, 2013. FileNotFoundException: the system cannot find the file specified. That being said, you need to determine if the file is to be an. new File("word.txt"); System. out.println("Attempting to read from file in:. I was reading path from a properties file and didn't mention there. Error trying to read from a text file.

Sep 27, 2011  · ERROR_SUCCESS – 0x00070000 – (0) The operation completed successfully. ERROR_INVALID_FUNCTION – 0x80070001 – (1) Incorrect function. ERROR_FILE_NOT_FOUND.

Torrent starts downloading for a few sec. then I get this error "Error: The system can not. Because both cannot. The system can not find the path specified.

Installing Oracle instantclient basic and instantclient. – Sometimes basic things like installing the latest Oracle instantclient on the PCs of all of your developers can take considerable time. I typically setup a

Visual CUT User Manual.

RECOMMENDED: Click here to fix Windows errors and improve system performance