Tutorial

Error Variably Modified Ameat File Scope

RECOMMENDED: If you have Windows errors then we strongly recommend that you download and run this (Windows) Repair Tool.

Contacts: Commonwealth of the Northern Mariana Islands Division of Environmental Quality P.O. Box 501304 Saipan, MP 96950 Telephone: 1-670-664-8500 http://www.deq.gov.mp/ Guam Environmental Protection Agency Administration.

Home > Variably Modified > Error Parameter May Not Have Variably. File Size 746 KB. Will Reimage fix my Error Parameter May Not Have Variably Modified Type.

Nov 30, 2012. Simple answer variable modified array at file scope is not possible. error: variable length array declaration not allowed at file scope static int.

. variably modified ‘proxy_assertion_broken’ at file scope Last modified:. error: variably modified ‘proxy_assertion_broken’ at file scope /home/user/gcc.

Error 6002 Entity Framework Jan 21, 2016. NET frameworks within the same application (MVC, Web API, SignalR). new AppTenant { Name = "Tenant 2", Hostnames = new[] { "localhost:6002" } } }); public async. Identity (using EntityFramework) so that users can register accounts for each Tenant in the same database?. Got the same error. Entity Framework can be so

JD Supra provides users with access to its legal industry publishing services (the "Service") through its website (the "Website") as well as through other sources. Our policies with regard to data collection and use of personal information.

Nov 11, 2009. The reason for this warning is that const in c doesn't mean constant. It means " read only". So the value is stored at a memory address and could.

Global Array – C – Programming Forums – Feb 11, 2010  · Global Array Thread Tools. Why am I with the following error: erro: variably modified ‘vet’ at file scope. problem processing file into a.

Error "Variably modified at file scope" nrf_atfifo.c. I am also receiving this compiler error. Currently I am setting up a fresh installation of Segger Embedded.

[Bug bootstrap/39616] New: Stage 2 Werror – trunk revision 145459 – libcpp/identifiers.c:113: error: variably modified ‘proxy_assertion_broken’ at file scope…

Bug 55009 – compile-time assertions no longer usable: error: variably modified ‘ari. variably modified ‘ari_sign_32_bit_and_wrap’ at file scope error 1.

Explanation needed for const int "error: variably modified. at file scope.". variably modified 'eodContents' at file scope. am always searching for the "K&R.

variably modified array at file scope in C – Stack Overflow –. it says error: variably modified 'Hello' at file scope. Simple answer variable modified array at file scope is not. but I am now myself facing this with.

Html Servlet Error Java.io.ioexception Connection Reset By Peer 25/Dec/2011 13:37:39 ERROR GServerHandler – java.io.IOException: Connection reset by peer java.io.IOException: Connection reset by peer at sun.nio.ch. SSO: java.io.IOException: Connection reset by peer Metalink id—– Errors. 08/08/14 10:11:35.348 html: Servlet error java.io.IOException: Connection reset by peer Mar 27, 2009. java.io.EOFException at java.io.DataInputStream.readInt(Unknown Source). FRM-92050 error also disappeared as forms was able to locate f60webmx. Java.net.SocketException:

News articles, blog posts and Google+ posts do not always link to articles in a way that can be picked up by.

Explanation needed for const int "error: variably modified. [eodSize]; >>> >>> error: variably modified 'eodContents' at file scope. , i am Getting this Error.

c – Variably modified array at file scope. but maybe I am going. when I compile it, it says error: variably modified ‘Hello’ at file scope how could this.

Msxml4 Dll Error 8007000e Wowhead Uploader Error Here's my solution to the problem: Wait until you see the upload % on the main window behind the error message go to 100, then hit "No" (to the quest… Now you can create your own design by simply drawing it on a blank piece of paper, taking a picture, and uploading

C error Variably modified at the file scope. 10. variably modified array at file scope in. How to deal with a religious relative who keeps assuming that I am.

I'm getting "variably modified" errors in C32 2.02 on code that compiled fine in 1.x. For example, I get: error: variably modified 'PastTrack' at file scope.

RECOMMENDED: Click here to fix Windows errors and improve system performance