Tutorial

Fatal Error C1083 Ft2build.h

How to fix "Error C1083 Cannot open include file: 'correct.h': no such file or directory"

RECOMMENDED: If you have Windows errors then we strongly recommend that you download and run this (Windows) Repair Tool.

c:usersnamedownloadsmatplotlib-1.1.0srcft2font.h(16) : fatal error C1083: Cannot open include file: 'ft2build.h': No such file or directory. error: command '"C :Program Files (x86)Microsoft Visual Studio 9.0VCBINcl.exe"' failed with exit status 2. I tried to install freetyp2 and I ran an executable available.

The compiler generates a C1083 error when it can't find a file. Here are the common reasons why the compiler generates this error. might not find the file you.

Aug 7, 2017. inst/include/ -I"/usr/local/lib/R/3.4/site-library/Rcpp/include" -I/usr/local/opt/gettext/ include -I/usr/local/opt/readline/include -I/usr/local/include -fPIC -g -O2 -c CairoContext.cpp -o CairoContext.o In file included from CairoContext.cpp:7: /usr/ local/opt/cairo/include/cairo/cairo-ft.h:46:10: fatal error: 'ft2build.h' file.

Include error. Visual Studio. [fatal error C1083: Cannot open include file:. If I right click the #include <ft2build.h> and choose "Open document.

Nov 19, 2013. c:pdfpodofo-0.9.1srcbasePdfDefines.h(66): fatal error C1083: Cannot open include file: 'boost/config.hpp': No such file or directory. If I disable boost, I get similar error for freetype library headers 2>..srcdocPdfFontCache.cpp(55): fatal error C1083: Cannot open include file: 'ft2build.h': No such file or.

python – Matplotlib Build Problem: Error C1083: Cannot open. – ft2build.h is located here: C:\Program Files\GnuWin32\include Initially, I made the same mistake as here: Fatal Error C1083: Cannot Open Include file: 'tiffio.h.

Dec 28, 2013. HHVM repository for Homebrew. Contribute to homebrew-hhvm development by creating an account on GitHub.

Messenger Error 1603 Error code 1603 While deploying symantec Endpoint protection. – Error code 1603 While deploying symantec Endpoint protection through MDT Task sequence as. Error 1603 within SEP was an issue with Windows Defender. This page has been translated for your convenience with an automatic translation service. This is not an official translation and may contain errors

having some problems using a font library. Im getting the current error c:\users\taylor\documents\uni\win32opengl2template\freetype.h(5): fatal error C1083: Cannot.

Oct 31, 2013. For Mac OS 10.6.8 sudo ln -s /usr/X11/include/freetype2/freetype /usr/X11/include /. Seems to do the trick. If you look at the /usr/X11/include/ft2build.h it seems as though it is really a problem with that header file and the way free type is installed , not a matplotlib problem.

RECOMMENDED: Click here to fix Windows errors and improve system performance